Jump to content
Mumble forums

build fails on Fedora 13, mumble-1.2.3.tar.gz


mrumunhum
 Share

Recommended Posts

Hi group,


Downloaded mumble-1.2.3.tar.gz, untared it and ran 'qmake-qt4 -recursive main.pro '. Got a lot of messages:

qmake-qt4 -recursive  main.pro 
Reading /src/Mumble/mumble-1.2.3/speexbuild/speexbuild.pro
Reading /src/Mumble/mumble-1.2.3/celt-0.7.0-build/celt-0.7.0-build.pro
Reading /src/Mumble/mumble-1.2.3/celt-0.11.0-build/celt-0.11.0-build.pro
Reading /src/Mumble/mumble-1.2.3/src/mumble11x/mumble11x.pro
WARNING: Failure to find: qt_de.qm
WARNING: Failure to find: qt_es.qm
WARNING: Failure to find: qt_fr.qm
WARNING: Failure to find: qt_ja_JP.qm
WARNING: Failure to find: qt_ru.qm
WARNING: Failure to find: qt_pl.qm
WARNING: Failure to find: qt_zh_CN.qm
WARNING: Failure to find: qt_zh_TW.qm
WARNING: Failure to find: qt_de.qm
WARNING: Failure to find: qt_es.qm
WARNING: Failure to find: qt_fr.qm
WARNING: Failure to find: qt_ja_JP.qm
WARNING: Failure to find: qt_ru.qm
WARNING: Failure to find: qt_pl.qm
WARNING: Failure to find: qt_zh_CN.qm
WARNING: Failure to find: qt_zh_TW.qm
RCC: Error in 'mumble.qrc': Cannot find file 'mumble_en.qm'
RCC: Error in 'mumble.qrc': Cannot find file 'mumble_es.qm'
RCC: Error in 'mumble.qrc': Cannot find file 'mumble_fr.qm'
RCC: Error in 'mumble.qrc': Cannot find file 'mumble_de.qm'
RCC: Error in 'mumble.qrc': Cannot find file 'mumble_it.qm'
RCC: Error in 'mumble.qrc': Cannot find file 'mumble_ru.qm'
RCC: Error in 'mumble.qrc': Cannot find file 'mumble_ja.qm'
RCC: Error in 'mumble.qrc': Cannot find file 'mumble_cs.qm'
RCC: Error in 'mumble.qrc': Cannot find file 'mumble_pl.qm'
RCC: Error in 'mumble.qrc': Cannot find file 'mumble_zh_CN.qm'
RCC: Error in 'mumble.qrc': Cannot find file 'mumble_zh_TW.qm'
RCC: Error in 'mumble_qt.qrc': Cannot find file 'qt_de.qm'
RCC: Error in 'mumble_qt.qrc': Cannot find file 'qt_es.qm'
RCC: Error in 'mumble_qt.qrc': Cannot find file 'qt_fr.qm'
RCC: Error in 'mumble_qt.qrc': Cannot find file 'qt_ru.qm'
RCC: Error in 'mumble_qt.qrc': Cannot find file 'qt_pl.qm'
RCC: Error in 'mumble_qt.qrc': Cannot find file 'qt_ja.qm'
RCC: Warning: No resources in 'mumble_qt.qrc'.
RCC: Error in 'mumble.qrc': Cannot find file 'mumble_en.qm'
RCC: Error in 'mumble.qrc': Cannot find file 'mumble_es.qm'
RCC: Error in 'mumble.qrc': Cannot find file 'mumble_fr.qm'
RCC: Error in 'mumble.qrc': Cannot find file 'mumble_de.qm'
RCC: Error in 'mumble.qrc': Cannot find file 'mumble_it.qm'
RCC: Error in 'mumble.qrc': Cannot find file 'mumble_ru.qm'
RCC: Error in 'mumble.qrc': Cannot find file 'mumble_ja.qm'
RCC: Error in 'mumble.qrc': Cannot find file 'mumble_cs.qm'
RCC: Error in 'mumble.qrc': Cannot find file 'mumble_pl.qm'
RCC: Error in 'mumble.qrc': Cannot find file 'mumble_zh_CN.qm'
RCC: Error in 'mumble.qrc': Cannot find file 'mumble_zh_TW.qm'
RCC: Error in 'mumble_qt.qrc': Cannot find file 'qt_de.qm'
RCC: Error in 'mumble_qt.qrc': Cannot find file 'qt_es.qm'
RCC: Error in 'mumble_qt.qrc': Cannot find file 'qt_fr.qm'
RCC: Error in 'mumble_qt.qrc': Cannot find file 'qt_ru.qm'
RCC: Error in 'mumble_qt.qrc': Cannot find file 'qt_pl.qm'
RCC: Error in 'mumble_qt.qrc': Cannot find file 'qt_ja.qm'
RCC: Warning: No resources in 'mumble_qt.qrc'.
Reading /src/Mumble/mumble-1.2.3/src/mumble/mumble.pro
WARNING: Failure to find: Mumble.pb.cc
WARNING: Failure to find: qt_de.qm
WARNING: Failure to find: qt_es.qm
WARNING: Failure to find: qt_fr.qm
WARNING: Failure to find: qt_ja_JP.qm
WARNING: Failure to find: qt_ru.qm
WARNING: Failure to find: qt_pl.qm
WARNING: Failure to find: qt_pt.qm
WARNING: Failure to find: qt_sv.qm
WARNING: Failure to find: qt_zh_CN.qm
WARNING: Failure to find: qt_zh_TW.qm
WARNING: Failure to find: Mumble.pb.cc
WARNING: Failure to find: qt_de.qm
WARNING: Failure to find: qt_es.qm
WARNING: Failure to find: qt_fr.qm
WARNING: Failure to find: qt_ja_JP.qm
WARNING: Failure to find: qt_ru.qm
WARNING: Failure to find: qt_pl.qm
WARNING: Failure to find: qt_pt.qm
WARNING: Failure to find: qt_sv.qm
WARNING: Failure to find: qt_zh_CN.qm
WARNING: Failure to find: qt_zh_TW.qm
RCC: Error in 'mumble.qrc': Cannot find file 'mumble_en.qm'
RCC: Error in 'mumble.qrc': Cannot find file 'mumble_es.qm'
RCC: Error in 'mumble.qrc': Cannot find file 'mumble_fr.qm'
RCC: Error in 'mumble.qrc': Cannot find file 'mumble_de.qm'
RCC: Error in 'mumble.qrc': Cannot find file 'mumble_it.qm'
RCC: Error in 'mumble.qrc': Cannot find file 'mumble_ja.qm'
RCC: Error in 'mumble.qrc': Cannot find file 'mumble_pl.qm'
RCC: Error in 'mumble.qrc': Cannot find file 'mumble_pt_BR.qm'
RCC: Error in 'mumble.qrc': Cannot find file 'mumble_da.qm'
RCC: Error in 'mumble.qrc': Cannot find file 'mumble_he.qm'
RCC: Error in 'mumble.qrc': Cannot find file 'mumble_ru.qm'
RCC: Error in 'mumble.qrc': Cannot find file 'mumble_sv.qm'
RCC: Error in 'mumble_qt.qrc': Cannot find file 'qt_de.qm'
RCC: Error in 'mumble_qt.qrc': Cannot find file 'qt_es.qm'
RCC: Error in 'mumble_qt.qrc': Cannot find file 'qt_fr.qm'
RCC: Error in 'mumble_qt.qrc': Cannot find file 'qt_pl.qm'
RCC: Error in 'mumble_qt.qrc': Cannot find file 'qt_pt.qm'
RCC: Error in 'mumble_qt.qrc': Cannot find file 'qt_ru.qm'
RCC: Error in 'mumble_qt.qrc': Cannot find file 'qt_sv.qm'
RCC: Error in 'mumble_qt.qrc': Cannot find file 'qt_ja.qm'
RCC: Warning: No resources in 'mumble_qt.qrc'.
RCC: Error in 'mumble.qrc': Cannot find file 'mumble_en.qm'
RCC: Error in 'mumble.qrc': Cannot find file 'mumble_es.qm'
RCC: Error in 'mumble.qrc': Cannot find file 'mumble_fr.qm'
RCC: Error in 'mumble.qrc': Cannot find file 'mumble_de.qm'
RCC: Error in 'mumble.qrc': Cannot find file 'mumble_it.qm'
RCC: Error in 'mumble.qrc': Cannot find file 'mumble_ja.qm'
RCC: Error in 'mumble.qrc': Cannot find file 'mumble_pl.qm'
RCC: Error in 'mumble.qrc': Cannot find file 'mumble_pt_BR.qm'
RCC: Error in 'mumble.qrc': Cannot find file 'mumble_da.qm'
RCC: Error in 'mumble.qrc': Cannot find file 'mumble_he.qm'
RCC: Error in 'mumble.qrc': Cannot find file 'mumble_ru.qm'
RCC: Error in 'mumble.qrc': Cannot find file 'mumble_sv.qm'
RCC: Error in 'mumble_qt.qrc': Cannot find file 'qt_de.qm'
RCC: Error in 'mumble_qt.qrc': Cannot find file 'qt_es.qm'
RCC: Error in 'mumble_qt.qrc': Cannot find file 'qt_fr.qm'
RCC: Error in 'mumble_qt.qrc': Cannot find file 'qt_pl.qm'
RCC: Error in 'mumble_qt.qrc': Cannot find file 'qt_pt.qm'
RCC: Error in 'mumble_qt.qrc': Cannot find file 'qt_ru.qm'
RCC: Error in 'mumble_qt.qrc': Cannot find file 'qt_sv.qm'
RCC: Error in 'mumble_qt.qrc': Cannot find file 'qt_ja.qm'
RCC: Warning: No resources in 'mumble_qt.qrc'.
Reading /src/Mumble/mumble-1.2.3/plugins/plugins.pro
Reading /src/Mumble/mumble-1.2.3/plugins/link/link.pro
Reading /src/Mumble/mumble-1.2.3/plugins/manual/manual.pro
Reading /src/Mumble/mumble-1.2.3/overlay_gl/overlay_gl.pro
Project MESSAGE: Overriding linker
Project MESSAGE: Overriding linker
Project MESSAGE: Overriding linker
Reading /src/Mumble/mumble-1.2.3/src/murmur/murmur.pro
WARNING: Failure to find: Mumble.pb.cc
WARNING: Failure to find: Murmur.cpp
WARNING: Failure to find: Mumble.pb.cc
WARNING: Failure to find: Murmur.cpp

Ran the make, just for fun and got this error:

g++ -c -include release/mumble11x -pipe -Wfatal-errors -Wshadow -Woverloaded-virtual -Wold-style-cast -Wconversion -Wsign-compare -fvisibility=hidden -Wall -Wextra -I../../speex/include -I../../speexbuild -O2 -g -pipe -Wall -Wp,-D_FORTIFY_SOURCE=2 -fstack-protector --param=ssp-buffer-size=4 -m64 -mtune=generic -I../../speex/include -I../../speexbuild -I/usr/include/alsa -Wall -W -D_REENTRANT -DRESTRICT=__restrict__ -D_FORTIFY_SOURCE=2 -DMUMBLE_VERSION_STRING=1.1.8 -DMUMBLE_VERSION=1.1.x -DCOMPAT_CLIENT -DUSE_ALSA -DUSE_OSS -DUSE_DBUS -DUSE_SPEECHD -DNO_UPDATE_CHECK -DQT_NO_DEBUG -DQT_SQL_LIB -DQT_XML_LIB -DQT_OPENGL_LIB -DQT_GUI_LIB -DQT_NETWORK_LIB -DQT_CORE_LIB -I/usr/lib64/qt4/mkspecs/linux-g++ -I. -I/usr/include/QtCore -I/usr/include/QtNetwork -I/usr/include/QtGui -I/usr/include/QtOpenGL -I/usr/include/QtXml -I/usr/include/QtSql -I/usr/include -I/usr/include/QtDBus -I.. -I../../speex/include -I../../speex/libspeex -I../../speexbuild -I/usr/lib/oss/include -Irelease -I/usr/X11R6/include -I. -o release/TextToSpeech_unix.o TextToSpeech_unix.cpp
TextToSpeech_unix.cpp:34:24: error: libspeechd.h: No such file or directory
TextToSpeech_unix.cpp:40: error: ISO C++ forbids declaration of 'SPDConnection' with no type
compilation terminated due to -Wfatal-errors.
make[2]: *** [release/TextToSpeech_unix.o] Error 1
make[2]: Leaving directory `/src/Mumble/mumble-1.2.3/src/mumble11x'
make[1]: *** [release] Error 2
make[1]: Leaving directory `/src/Mumble/mumble-1.2.3/src/mumble11x'
make: *** [sub-src-mumble11x-make_default-ordered] Error 2

 

Any ideas?

Link to comment
Share on other sites

Join the conversation

You can post now and register later. If you have an account, sign in now to post with your account.

Guest
Reply to this topic...

×   Pasted as rich text.   Paste as plain text instead

  Only 75 emoji are allowed.

×   Your link has been automatically embedded.   Display as a link instead

×   Your previous content has been restored.   Clear editor

×   You cannot paste images directly. Upload or insert images from URL.

 Share

×
×
  • Create New...